{"text_format":"3","workbook":"xlsx","n_sheets":2,"sheets":["fullhard","20250416"],"not_rendered":{"defined_names":3},"read":"whole","date_system":"1900"}

{"sheet":"fullhard","index":0,"n_rows":173,"n_cols":7,"rows_kept":173}
[]
[null,"ID","Categoria","Spessore\n(mm)","Larghezza\n(mm)","Peso\n(kg)","kg / mm"]
[null,"FH000119001","Fullhard",0.26,{"v":1161,"d":"1,161"},{"v":2348,"d":"2,348"},{"$f":"F3/E3","v":{"v":2.0223944875107667,"d":"2.02"}}]
[null,"FH000119002","Fullhard",0.26,{"v":1162,"d":"1,162"},{"v":3864,"d":"3,864"},{"v":3.325301204819277,"d":"3.33"}]
[null,"FH000119003","Fullhard",0.27,{"v":1005,"d":"1,005"},{"v":5592,"d":"5,592"},{"v":5.564179104477612,"d":"5.56"}]
[null,"FH000119004","Fullhard",0.28,{"v":1055,"d":"1,055"},{"v":9764,"d":"9,764"},{"v":9.254976303317536,"d":"9.25"}]
[null,"FH000119012","Fullhard",0.28,{"v":1186,"d":"1,186"},{"v":5840,"d":"5,840"},{"v":4.924114671163575,"d":"4.92"}]
[null,"FH000119006","Fullhard",0.28,{"v":1205,"d":"1,205"},{"v":4275,"d":"4,275"},{"v":3.5477178423236513,"d":"3.55"}]
[null,"FH000119005","Fullhard",0.28,{"v":1255,"d":"1,255"},{"v":2600,"d":"2,600"},{"v":2.0717131474103585,"d":"2.07"}]
[null,"FH000119007","Fullhard",0.28,{"v":1255,"d":"1,255"},{"v":3600,"d":"3,600"},{"v":2.8685258964143427,"d":"2.87"}]
[null,"FH000119008","Fullhard",0.28,{"v":1255,"d":"1,255"},{"v":3000,"d":"3,000"},{"v":2.3904382470119523,"d":"2.39"}]
[null,"FH000119009","Fullhard",0.28,{"v":1255,"d":"1,255"},{"v":3900,"d":"3,900"},{"v":3.1075697211155378,"d":"3.11"}]
[null,"FH000119010","Fullhard",0.28,{"v":1255,"d":"1,255"},{"v":2500,"d":"2,500"},{"v":1.9920318725099602,"d":"1.99"}]
[null,"FH000119011","Fullhard",0.28,{"v":1255,"d":"1,255"},{"v":2250,"d":"2,250"},{"v":1.792828685258964,"d":"1.79"}]
[null,"FH000119013","Fullhard",0.29,{"v":1200,"d":"1,200"},{"v":8554,"d":"8,554"},{"v":7.128333333333333,"d":"7.13"}]
[null,"FH000119014","Fullhard",{"v":0.3,"d":"0.30"},{"v":1170,"d":"1,170"},{"v":1562,"d":"1,562"},{"v":1.335042735042735,"d":"1.34"}]
[null,"FH000119015","Fullhard",{"v":0.3,"d":"0.30"},{"v":1170,"d":"1,170"},{"v":1500,"d":"1,500"},{"v":1.2820512820512822,"d":"1.28"}]
[null,"FH000119016","Fullhard",{"v":0.3,"d":"0.30"},{"v":1170,"d":"1,170"},{"v":4150,"d":"4,150"},{"v":3.547008547008547,"d":"3.55"}]
[null,"FH000119019","Fullhard",{"v":0.3,"d":"0.30"},{"v":1223,"d":"1,223"},{"v":2700,"d":"2,700"},{"v":2.2076860179885527,"d":"2.21"}]
[null,"FH000119017","Fullhard",{"v":0.3,"d":"0.30"},{"v":1255,"d":"1,255"},{"v":4310,"d":"4,310"},{"v":3.4342629482071714,"d":"3.43"}]
[null,"FH000119018","Fullhard",{"v":0.3,"d":"0.30"},{"v":1255,"d":"1,255"},{"v":5565,"d":"5,565"},{"v":4.434262948207171,"d":"4.43"}]
[null,"FH000119022","Fullhard",0.31,{"v":1055,"d":"1,055"},{"v":1062,"d":"1,062"},{"v":1.0066350710900474,"d":"1.01"}]
[null,"FH000119023","Fullhard",0.31,{"v":1071,"d":"1,071"},{"v":1400,"d":"1,400"},{"v":1.3071895424836601,"d":"1.31"}]
[null,"FH000119020","Fullhard",0.31,{"v":1075,"d":"1,075"},{"v":1239,"d":"1,239"},{"v":1.1525581395348836,"d":"1.15"}]
[null,"FH000119021","Fullhard",0.31,{"v":1075,"d":"1,075"},{"v":1809,"d":"1,809"},{"v":1.6827906976744187,"d":"1.68"}]
[null,"FH000119024","Fullhard",0.31,{"v":1297,"d":"1,297"},{"v":9635,"d":"9,635"},{"v":7.428681572860447,"d":"7.43"}]
[null,"FH000119029","Fullhard",0.32,975,{"v":6846,"d":"6,846"},{"v":7.021538461538461,"d":"7.02"}]
[null,"FH000119026","Fullhard",0.32,{"v":1060,"d":"1,060"},{"v":3120,"d":"3,120"},{"v":2.943396226415094,"d":"2.94"}]
[null,"FH000119032","Fullhard",0.32,{"v":1065,"d":"1,065"},{"v":2031,"d":"2,031"},{"v":1.9070422535211267,"d":"1.91"}]
[null,"FH000119031","Fullhard",0.32,{"v":1071,"d":"1,071"},{"v":2550,"d":"2,550"},{"v":2.380952380952381,"d":"2.38"}]
[null,"FH000119027","Fullhard",0.32,{"v":1235,"d":"1,235"},{"v":4300,"d":"4,300"},{"v":3.4817813765182186,"d":"3.48"}]
[null,"FH000119030","Fullhard",0.32,{"v":1235,"d":"1,235"},{"v":3224,"d":"3,224"},{"v":2.610526315789474,"d":"2.61"}]
[null,"FH000119028","Fullhard",0.32,{"v":1257,"d":"1,257"},{"v":12646,"d":"12,646"},{"v":10.060461416070009,"d":"10.06"}]
[null,"FH000119025","Fullhard",0.32,{"v":1325,"d":"1,325"},{"v":2075,"d":"2,075"},{"v":1.5660377358490567,"d":"1.57"}]
[null,"FH000119033","Fullhard",0.34,{"v":1005,"d":"1,005"},{"v":5000,"d":"5,000"},{"$f":"F35/E35","v":{"v":4.975124378109452,"d":"4.98"}}]
[null,"FH000119041","Fullhard",0.35,{"v":1000,"d":"1,000"},{"v":5160,"d":"5,160"},5.16]
[null,"FH000119034","Fullhard",0.35,{"v":1070,"d":"1,070"},{"v":2114,"d":"2,114"},{"v":1.9757009345794392,"d":"1.98"}]
[null,"FH000119035","Fullhard",0.35,{"v":1076,"d":"1,076"},{"v":4030,"d":"4,030"},{"v":3.7453531598513012,"d":"3.75"}]
[null,"FH000119037","Fullhard",0.35,{"v":1255,"d":"1,255"},{"v":2100,"d":"2,100"},{"v":1.6733067729083666,"d":"1.67"}]
[null,"FH000119038","Fullhard",0.35,{"v":1255,"d":"1,255"},{"v":2025,"d":"2,025"},{"v":1.6135458167330676,"d":"1.61"}]
[null,"FH000119040","Fullhard",0.35,{"v":1275,"d":"1,275"},{"v":3400,"d":"3,400"},{"v":2.6666666666666665,"d":"2.67"}]
[null,"FH000119036","Fullhard",0.35,{"v":1385,"d":"1,385"},{"v":4700,"d":"4,700"},{"v":3.3935018050541514,"d":"3.39"}]
[null,"FH000119039","Fullhard",0.35,{"v":1385,"d":"1,385"},{"v":2300,"d":"2,300"},{"v":1.660649819494585,"d":"1.66"}]
[null,"FH000119042","Fullhard",0.36,{"v":1091,"d":"1,091"},{"v":1500,"d":"1,500"},{"v":1.374885426214482,"d":"1.37"}]
[null,"FH000119044","Fullhard",0.38,{"v":1255,"d":"1,255"},{"v":4494,"d":"4,494"},{"v":3.5808764940239044,"d":"3.58"}]
[null,"FH000119045","Fullhard",{"v":0.4,"d":"0.40"},{"v":1030,"d":"1,030"},{"v":12273,"d":"12,273"},{"v":11.915533980582524,"d":"11.92"}]
[null,"FH000119048","Fullhard",{"v":0.4,"d":"0.40"},{"v":1227,"d":"1,227"},{"v":1902,"d":"1,902"},{"v":1.550122249388753,"d":"1.55"}]
[null,"FH000119049","Fullhard",{"v":0.4,"d":"0.40"},{"v":1257,"d":"1,257"},{"v":2370,"d":"2,370"},{"v":1.8854415274463008,"d":"1.89"}]
[null,"FH000119054","Fullhard",0.42,{"v":1072,"d":"1,072"},{"v":4980,"d":"4,980"},{"v":4.645522388059701,"d":"4.65"}]
[null,"FH000119052","Fullhard",0.42,{"v":1255,"d":"1,255"},{"v":1520,"d":"1,520"},{"v":1.2111553784860558,"d":"1.21"}]
[null,"FH000119053","Fullhard",0.42,{"v":1255,"d":"1,255"},{"v":6500,"d":"6,500"},{"v":5.179282868525896,"d":"5.18"}]
[null,"FH000119055","Fullhard",0.42,{"v":1255,"d":"1,255"},{"v":3900,"d":"3,900"},{"v":3.1075697211155378,"d":"3.11"}]
[null,"FH000119056","Fullhard",0.43,{"v":1392,"d":"1,392"},{"v":2400,"d":"2,400"},{"v":1.7241379310344827,"d":"1.72"}]
[null,"FH000119057","Fullhard",0.43,{"v":1392,"d":"1,392"},{"v":2900,"d":"2,900"},{"v":2.0833333333333335,"d":"2.08"}]
[null,"FH000119059","Fullhard",0.44,{"v":1150,"d":"1,150"},{"v":1335,"d":"1,335"},{"v":1.1608695652173913,"d":"1.16"}]
[null,"FH000119058","Fullhard",0.44,{"v":1257,"d":"1,257"},{"v":1786,"d":"1,786"},{"v":1.420843277645187,"d":"1.42"}]
[null,"FH000119071","Fullhard",0.45,{"v":1005,"d":"1,005"},{"v":4960,"d":"4,960"},{"v":4.935323383084577,"d":"4.94"}]
[null,"FH000119070","Fullhard",0.45,{"v":1090,"d":"1,090"},{"v":2391,"d":"2,391"},{"v":2.193577981651376,"d":"2.19"}]
[null,"FH000119067","Fullhard",0.45,{"v":1222,"d":"1,222"},{"v":3630,"d":"3,630"},{"v":2.9705400981996726,"d":"2.97"}]
[null,"FH000119063","Fullhard",0.45,{"v":1227,"d":"1,227"},{"v":27600,"d":"27,600"},{"v":22.493887530562347,"d":"22.49"}]
{"$rows_left_out":114}
{"sheet":"20250416","index":1,"n_rows":288,"n_cols":16,"rows_kept":288,"hidden":true}
[{"$nulls":4},"Marcegaglia | Gazoldo",{"$nulls":3},"2025-04-03"]
[null,"Partita","ID","ID","Categoria","Grado","Spessore\n(mm)","Larghezza\n(mm)","Peso\n(kg)","kg / mm","Pezzi","Commento","GSM","SID","SF","FM"]
[null,"25H8003409","SC000416001",1,"Laminato a freddo","DC04C490",0.78,{"v":406,"d":"406.00"},{"v":1796,"d":"1,796"},{"$f":"I3/K3/H3","v":{"v":4.4236453201970445,"d":"4.42"}},1,null,{"$f":"IFERROR(VLOOKUP(C3,#REF!,6,FALSE),\"\")","v":""},{"$f":"IFERROR(VLOOKUP(C3,#REF!,6,FALSE),\"\")","v":""},null,{"$f":"IFERROR(VLOOKUP(C3,#REF!,6,FALSE),\"\")","v":""}]
[null,"25H8003408","SC000416002",2,"Laminato a freddo","DC04C490",0.78,{"v":406,"d":"406.00"},{"v":1796,"d":"1,796"},{"v":4.4236453201970445,"d":"4.42"},1,null,{"$f":"IFERROR(VLOOKUP(C4,#REF!,6,FALSE),\"\")","v":""},{"$f":"IFERROR(VLOOKUP(C4,#REF!,6,FALSE),\"\")","v":""},null,{"$f":"IFERROR(VLOOKUP(C4,#REF!,6,FALSE),\"\")","v":""}]
[null,"25H8003407","SC000416003",3,"Laminato a freddo","DC04C490",0.78,{"v":440,"d":"440.00"},{"v":1946,"d":"1,946"},{"v":4.422727272727273,"d":"4.42"},1,null,{"$f":"IFERROR(VLOOKUP(C5,#REF!,6,FALSE),\"\")","v":""},{"$f":"IFERROR(VLOOKUP(C5,#REF!,6,FALSE),\"\")","v":""},null,{"$f":"IFERROR(VLOOKUP(C5,#REF!,6,FALSE),\"\")","v":""}]
[null,"24H8002600","SC000416004",4,"Decapato","DD13",{"v":3.5,"d":"3.50"},{"v":636,"d":"636.00"},{"v":6850,"d":"6,850"},{"v":10.770440251572326,"d":"10.77"},1,null,{"$f":"IFERROR(VLOOKUP(C6,#REF!,6,FALSE),\"\")","v":""},{"$f":"IFERROR(VLOOKUP(C6,#REF!,6,FALSE),\"\")","v":""},null,{"$f":"IFERROR(VLOOKUP(C6,#REF!,6,FALSE),\"\")","v":""}]
[null,"24H6006508","SC000416005",5,"Decapato","DD13",{"v":6.5,"d":"6.50"},{"v":888,"d":"888.00"},{"v":6430,"d":"6,430"},{"v":7.240990990990991,"d":"7.24"},1,null,{"$f":"IFERROR(VLOOKUP(C7,#REF!,6,FALSE),\"\")","v":""},{"$f":"IFERROR(VLOOKUP(C7,#REF!,6,FALSE),\"\")","v":""},null,{"$f":"IFERROR(VLOOKUP(C7,#REF!,6,FALSE),\"\")","v":""}]
[null,"25H6001459","SC000416006",6,"Decapato","DD13",{"v":6.5,"d":"6.50"},{"v":888,"d":"888.00"},{"v":5666,"d":"5,666"},{"v":6.38063063063063,"d":"6.38"},1,null,{"$f":"IFERROR(VLOOKUP(C8,#REF!,6,FALSE),\"\")","v":""},{"$f":"IFERROR(VLOOKUP(C8,#REF!,6,FALSE),\"\")","v":""},null,{"$f":"IFERROR(VLOOKUP(C8,#REF!,6,FALSE),\"\")","v":""}]
[null,"24H6006523","SC000416007",7,"Decapato","DD13",6.99,{"v":835,"d":"835.00"},{"v":5328,"d":"5,328"},{"v":6.380838323353293,"d":"6.38"},1,null,{"$f":"IFERROR(VLOOKUP(C9,#REF!,6,FALSE),\"\")","v":""},{"$f":"IFERROR(VLOOKUP(C9,#REF!,6,FALSE),\"\")","v":""},null,{"$f":"IFERROR(VLOOKUP(C9,#REF!,6,FALSE),\"\")","v":""}]
[null,"23AW023191","SC000416008",8,"Laminato a freddo","DC04",{"v":3,"d":"3.00"},{"v":417,"d":"417.00"},{"v":5840,"d":"5,840"},{"v":14.004796163069544,"d":"14.00"},1,null,{"$f":"IFERROR(VLOOKUP(C10,#REF!,6,FALSE),\"\")","v":""},{"$f":"IFERROR(VLOOKUP(C10,#REF!,6,FALSE),\"\")","v":""},null,{"$f":"IFERROR(VLOOKUP(C10,#REF!,6,FALSE),\"\")","v":""}]
[null,"24LU03****","SC000416009",9,"Elettro-zincato","DC01+ZE0/7,5",1.87,{"v":450,"d":"450.00"},{"v":6418,"d":"6,418"},{"v":14.262222222222222,"d":"14.26"},1,null,{"$f":"IFERROR(VLOOKUP(C11,#REF!,6,FALSE),\"\")","v":""},{"$f":"IFERROR(VLOOKUP(C11,#REF!,6,FALSE),\"\")","v":""},null,{"$f":"IFERROR(VLOOKUP(C11,#REF!,6,FALSE),\"\")","v":""}]
[null,"25H6002255","SC000416010",10,"Decapato","DD13",{"v":4.5,"d":"4.50"},{"v":240,"d":"240.00"},{"v":2669,"d":"2,669"},{"v":11.120833333333334,"d":"11.12"},1,null,{"$f":"IFERROR(VLOOKUP(C12,#REF!,6,FALSE),\"\")","v":""},{"$f":"IFERROR(VLOOKUP(C12,#REF!,6,FALSE),\"\")","v":""},null,{"$f":"IFERROR(VLOOKUP(C12,#REF!,6,FALSE),\"\")","v":""}]
[null,"25H6002252","SC000416011",11,"Decapato","DD13",{"v":4.5,"d":"4.50"},{"v":240,"d":"240.00"},{"v":2585,"d":"2,585"},{"v":10.770833333333334,"d":"10.77"},1,null,{"$f":"IFERROR(VLOOKUP(C13,#REF!,6,FALSE),\"\")","v":""},{"$f":"IFERROR(VLOOKUP(C13,#REF!,6,FALSE),\"\")","v":""},null,{"$f":"IFERROR(VLOOKUP(C13,#REF!,6,FALSE),\"\")","v":""}]
[null,"25H6002413","SC000416012",12,"Decapato","S500MC",{"v":4,"d":"4.00"},{"v":347,"d":"347.00"},{"v":3183,"d":"3,183"},{"v":9.172910662824208,"d":"9.17"},1,null,{"$f":"IFERROR(VLOOKUP(C14,#REF!,6,FALSE),\"\")","v":""},{"$f":"IFERROR(VLOOKUP(C14,#REF!,6,FALSE),\"\")","v":""},null,{"$f":"IFERROR(VLOOKUP(C14,#REF!,6,FALSE),\"\")","v":""}]
[null,"24RB045866","SC000416013",13,"Zincato","DX51D+Z275 MAC",{"v":2.5,"d":"2.50"},{"v":1250,"d":"1,250.00"},{"v":21400,"d":"21,400"},17.12,1,null,{"$f":"IFERROR(VLOOKUP(C15,#REF!,6,FALSE),\"\")","v":""},{"$f":"IFERROR(VLOOKUP(C15,#REF!,6,FALSE),\"\")","v":""},{"$f":"I15","v":{"v":21400,"d":"21,400"}},{"$f":"IFERROR(VLOOKUP(C15,#REF!,6,FALSE),\"\")","v":""}]
[null,"25H8003269","SC000416014",14,"Laminato a freddo - ricotto","C45E",1.19,{"v":520,"d":"520.00"},{"v":7357,"d":"7,357"},{"v":14.148076923076923,"d":"14.15"},1,null,{"$f":"IFERROR(VLOOKUP(C16,#REF!,6,FALSE),\"\")","v":""},{"$f":"IFERROR(VLOOKUP(C16,#REF!,6,FALSE),\"\")","v":""},null,{"$f":"IFERROR(VLOOKUP(C16,#REF!,6,FALSE),\"\")","v":""}]
[null,"25H8003269","SC000416015",15,"Laminato a freddo - ricotto","C45E",1.19,{"v":620,"d":"620.00"},{"v":8775,"d":"8,775"},{"v":14.153225806451612,"d":"14.15"},1,null,{"$f":"IFERROR(VLOOKUP(C17,#REF!,6,FALSE),\"\")","v":""},{"$f":"IFERROR(VLOOKUP(C17,#REF!,6,FALSE),\"\")","v":""},null,{"$f":"IFERROR(VLOOKUP(C17,#REF!,6,FALSE),\"\")","v":""}]
[null,"025G203384","SC000416016",16,"Laminato a freddo","DC04",0.71,{"v":51.5,"d":"51.50"},{"v":3482,"d":"3,482"},{"v":5.634304207119741,"d":"5.63"},12,null,{"$f":"IFERROR(VLOOKUP(C18,#REF!,6,FALSE),\"\")","v":""},{"$f":"IFERROR(VLOOKUP(C18,#REF!,6,FALSE),\"\")","v":""},null,{"$f":"IFERROR(VLOOKUP(C18,#REF!,6,FALSE),\"\")","v":""}]
[null,"25HB012042","SC000416017",17,"Laminato a freddo","HC380LA",{"v":1.5,"d":"1.50"},{"v":245,"d":"245.00"},{"v":1785,"d":"1,785"},{"v":7.285714285714286,"d":"7.29"},1,null,{"$f":"IFERROR(VLOOKUP(C19,#REF!,6,FALSE),\"\")","v":""},{"$f":"IFERROR(VLOOKUP(C19,#REF!,6,FALSE),\"\")","v":""},null,{"$f":"IFERROR(VLOOKUP(C19,#REF!,6,FALSE),\"\")","v":""}]
[null,"025G106718","SC000416018",18,"Laminato a freddo","DC05",0.59,{"v":51.5,"d":"51.50"},324,{"v":6.29126213592233,"d":"6.29"},1,null,{"$f":"IFERROR(VLOOKUP(C20,#REF!,6,FALSE),\"\")","v":""},{"$f":"IFERROR(VLOOKUP(C20,#REF!,6,FALSE),\"\")","v":""},null,{"$f":"IFERROR(VLOOKUP(C20,#REF!,6,FALSE),\"\")","v":""}]
[null,"25H8007788","SC000416019",19,"Laminato a freddo","DC01",2.91,{"v":155,"d":"155.00"},978,{"v":6.309677419354839,"d":"6.31"},1,null,{"$f":"I21","v":978},{"$f":"IFERROR(VLOOKUP(C21,#REF!,6,FALSE),\"\")","v":""},null,{"$f":"I21","v":978}]
[null,"25H8007793","SC000416020",19,"Laminato a freddo","DC01",2.91,{"v":155,"d":"155.00"},822,{"v":5.303225806451613,"d":"5.30"},1,null,{"$f":"I22","v":822},{"$f":"IFERROR(VLOOKUP(C22,#REF!,6,FALSE),\"\")","v":""},null,{"$f":"I22","v":822}]
[null,"25H8007783","SC000416021",19,"Laminato a freddo","DC01",2.91,{"v":155,"d":"155.00"},802,{"v":5.174193548387096,"d":"5.17"},1,null,{"$f":"I23","v":802},{"$f":"IFERROR(VLOOKUP(C23,#REF!,6,FALSE),\"\")","v":""},null,{"$f":"I23","v":802}]
[null,"25H8007778","SC000416022",19,"Laminato a freddo","DC01",2.91,{"v":155,"d":"155.00"},842,{"v":5.432258064516129,"d":"5.43"},1,null,{"$f":"I24","v":842},{"$f":"IFERROR(VLOOKUP(C24,#REF!,6,FALSE),\"\")","v":""},null,{"$f":"I24","v":842}]
[null,"25H8007718","SC000416023",20,"Laminato a freddo","DC01",2.91,{"v":115,"d":"115.00"},723,{"v":6.28695652173913,"d":"6.29"},1,null,{"$f":"I25","v":723},{"$f":"IFERROR(VLOOKUP(C25,#REF!,6,FALSE),\"\")","v":""},null,{"$f":"IFERROR(VLOOKUP(C25,#REF!,6,FALSE),\"\")","v":""}]
[null,"25H8007723","SC000416024",20,"Laminato a freddo","DC01",2.91,{"v":115,"d":"115.00"},747,{"v":6.495652173913044,"d":"6.50"},1,null,747,{"$f":"IFERROR(VLOOKUP(C26,#REF!,6,FALSE),\"\")","v":""},null,{"$f":"IFERROR(VLOOKUP(C26,#REF!,6,FALSE),\"\")","v":""}]
[null,"25H8007713","SC000416025",20,"Laminato a freddo","DC01",2.91,{"v":115,"d":"115.00"},755,{"v":6.565217391304348,"d":"6.57"},1,null,755,{"$f":"IFERROR(VLOOKUP(C27,#REF!,6,FALSE),\"\")","v":""},null,{"$f":"IFERROR(VLOOKUP(C27,#REF!,6,FALSE),\"\")","v":""}]
[null,"25H8007728","SC000416026",20,"Laminato a freddo","DC01",2.91,{"v":115,"d":"115.00"},804,{"v":6.991304347826087,"d":"6.99"},1,null,804,{"$f":"IFERROR(VLOOKUP(C28,#REF!,6,FALSE),\"\")","v":""},null,{"$f":"IFERROR(VLOOKUP(C28,#REF!,6,FALSE),\"\")","v":""}]
[null,"25H8007758","SC000416027",21,"Laminato a freddo","DC01",2.91,{"v":155,"d":"155.00"},914,{"v":5.896774193548387,"d":"5.90"},1,null,914,{"$f":"IFERROR(VLOOKUP(C29,#REF!,6,FALSE),\"\")","v":""},null,{"$f":"M29","v":914}]
[null,"25H8007798","SC000416028",21,"Laminato a freddo","DC01",2.91,{"v":155,"d":"155.00"},914,{"v":5.896774193548387,"d":"5.90"},1,null,914,{"$f":"IFERROR(VLOOKUP(C30,#REF!,6,FALSE),\"\")","v":""},null,{"$f":"M30","v":914}]
[null,"25H8007763","SC000416029",21,"Laminato a freddo","DC01",2.91,{"v":155,"d":"155.00"},914,{"v":5.896774193548387,"d":"5.90"},1,null,914,{"$f":"IFERROR(VLOOKUP(C31,#REF!,6,FALSE),\"\")","v":""},null,{"$f":"M31","v":914}]
[null,"25H8007753","SC000416030",21,"Laminato a freddo","DC01",2.91,{"v":155,"d":"155.00"},914,{"v":5.896774193548387,"d":"5.90"},1,null,914,{"$f":"IFERROR(VLOOKUP(C32,#REF!,6,FALSE),\"\")","v":""},null,{"$f":"M32","v":914}]
[null,"25H8007748","SC000416031",22,"Laminato a freddo","DC01",2.91,{"v":115,"d":"115.00"},838,{"v":7.28695652173913,"d":"7.29"},1,null,838,{"$f":"IFERROR(VLOOKUP(C33,#REF!,6,FALSE),\"\")","v":""},null,{"$f":"IFERROR(VLOOKUP(C33,#REF!,6,FALSE),\"\")","v":""}]
[null,"25H8007743","SC000416032",22,"Laminato a freddo","DC01",2.91,{"v":115,"d":"115.00"},924,{"v":8.034782608695652,"d":"8.03"},1,null,924,{"$f":"IFERROR(VLOOKUP(C34,#REF!,6,FALSE),\"\")","v":""},null,{"$f":"IFERROR(VLOOKUP(C34,#REF!,6,FALSE),\"\")","v":""}]
[null,"25H8007738","SC000416033",22,"Laminato a freddo","DC01",2.91,{"v":115,"d":"115.00"},771,{"v":6.7043478260869565,"d":"6.70"},1,null,771,{"$f":"IFERROR(VLOOKUP(C35,#REF!,6,FALSE),\"\")","v":""},null,{"$f":"IFERROR(VLOOKUP(C35,#REF!,6,FALSE),\"\")","v":""}]
[null,"25H8007733","SC000416034",22,"Laminato a freddo","DC01",2.91,{"v":115,"d":"115.00"},729,{"v":6.339130434782609,"d":"6.34"},1,null,729,{"$f":"IFERROR(VLOOKUP(C36,#REF!,6,FALSE),\"\")","v":""},null,{"$f":"IFERROR(VLOOKUP(C36,#REF!,6,FALSE),\"\")","v":""}]
[null,"25H8008840","SC000416035",23,"Laminato a freddo","DC05",{"v":0.5,"d":"0.50"},{"v":76,"d":"76.00"},900,{"v":11.842105263157896,"d":"11.84"},1,null,{"$f":"IFERROR(VLOOKUP(C37,#REF!,6,FALSE),\"\")","v":""},{"$f":"IFERROR(VLOOKUP(C37,#REF!,6,FALSE),\"\")","v":""},null,{"$f":"IFERROR(VLOOKUP(C37,#REF!,6,FALSE),\"\")","v":""}]
[null,"25H8008502","SC000416036",24,"Laminato a freddo","P05",1.18,{"v":91,"d":"91.00"},791,{"v":8.692307692307692,"d":"8.69"},1,null,{"$f":"IFERROR(VLOOKUP(C38,#REF!,6,FALSE),\"\")","v":""},{"$f":"IFERROR(VLOOKUP(C38,#REF!,6,FALSE),\"\")","v":""},null,{"$f":"IFERROR(VLOOKUP(C38,#REF!,6,FALSE),\"\")","v":""}]
[null,"25H8008503","SC000416037",24,"Laminato a freddo","P05",1.18,{"v":91,"d":"91.00"},805,{"v":8.846153846153847,"d":"8.85"},1,null,{"$f":"IFERROR(VLOOKUP(C39,#REF!,6,FALSE),\"\")","v":""},{"$f":"IFERROR(VLOOKUP(C39,#REF!,6,FALSE),\"\")","v":""},null,{"$f":"IFERROR(VLOOKUP(C39,#REF!,6,FALSE),\"\")","v":""}]
[null,"25H8008515","SC000416038",24,"Laminato a freddo","P05",1.18,{"v":91,"d":"91.00"},805,{"v":8.846153846153847,"d":"8.85"},1,null,{"$f":"IFERROR(VLOOKUP(C40,#REF!,6,FALSE),\"\")","v":""},{"$f":"IFERROR(VLOOKUP(C40,#REF!,6,FALSE),\"\")","v":""},null,{"$f":"IFERROR(VLOOKUP(C40,#REF!,6,FALSE),\"\")","v":""}]
[null,"25H8008490","SC000416039",24,"Laminato a freddo","P05",1.18,{"v":91,"d":"91.00"},791,{"v":8.692307692307692,"d":"8.69"},1,null,{"$f":"IFERROR(VLOOKUP(C41,#REF!,6,FALSE),\"\")","v":""},{"$f":"IFERROR(VLOOKUP(C41,#REF!,6,FALSE),\"\")","v":""},null,{"$f":"IFERROR(VLOOKUP(C41,#REF!,6,FALSE),\"\")","v":""}]
[null,"25H8008464","SC000416040",25,"Laminato a freddo","P05",1.18,{"v":91,"d":"91.00"},798,{"v":8.76923076923077,"d":"8.77"},1,null,{"$f":"IFERROR(VLOOKUP(C42,#REF!,6,FALSE),\"\")","v":""},{"$f":"IFERROR(VLOOKUP(C42,#REF!,6,FALSE),\"\")","v":""},null,{"$f":"IFERROR(VLOOKUP(C42,#REF!,6,FALSE),\"\")","v":""}]
[null,"25H8008476","SC000416041",25,"Laminato a freddo","P05",1.18,{"v":91,"d":"91.00"},798,{"v":8.76923076923077,"d":"8.77"},1,null,{"$f":"IFERROR(VLOOKUP(C43,#REF!,6,FALSE),\"\")","v":""},{"$f":"IFERROR(VLOOKUP(C43,#REF!,6,FALSE),\"\")","v":""},null,{"$f":"IFERROR(VLOOKUP(C43,#REF!,6,FALSE),\"\")","v":""}]
[null,"25H8008477","SC000416042",25,"Laminato a freddo","P05",1.18,{"v":91,"d":"91.00"},805,{"v":8.846153846153847,"d":"8.85"},1,null,{"$f":"IFERROR(VLOOKUP(C44,#REF!,6,FALSE),\"\")","v":""},{"$f":"IFERROR(VLOOKUP(C44,#REF!,6,FALSE),\"\")","v":""},null,{"$f":"IFERROR(VLOOKUP(C44,#REF!,6,FALSE),\"\")","v":""}]
[null,"25H8008489","SC000416043",25,"Laminato a freddo","P05",1.18,{"v":91,"d":"91.00"},805,{"v":8.846153846153847,"d":"8.85"},1,null,{"$f":"IFERROR(VLOOKUP(C45,#REF!,6,FALSE),\"\")","v":""},{"$f":"IFERROR(VLOOKUP(C45,#REF!,6,FALSE),\"\")","v":""},null,{"$f":"IFERROR(VLOOKUP(C45,#REF!,6,FALSE),\"\")","v":""}]
[null,"25H8008508","SC000416044",26,"Laminato a freddo","P05",{"v":1.2,"d":"1.20"},{"v":120,"d":"120.00"},{"v":1062,"d":"1,062"},8.85,1,null,{"$f":"IFERROR(VLOOKUP(C46,#REF!,6,FALSE),\"\")","v":""},{"$f":"IFERROR(VLOOKUP(C46,#REF!,6,FALSE),\"\")","v":""},null,{"$f":"IFERROR(VLOOKUP(C46,#REF!,6,FALSE),\"\")","v":""}]
[null,"25H8008509","SC000416045",26,"Laminato a freddo","P05",{"v":1.2,"d":"1.20"},{"v":120,"d":"120.00"},{"v":1062,"d":"1,062"},8.85,1,null,{"$f":"IFERROR(VLOOKUP(C47,#REF!,6,FALSE),\"\")","v":""},{"$f":"IFERROR(VLOOKUP(C47,#REF!,6,FALSE),\"\")","v":""},null,{"$f":"IFERROR(VLOOKUP(C47,#REF!,6,FALSE),\"\")","v":""}]
[null,"***","SC000416046",26,"Laminato a freddo","P05",{"v":1.2,"d":"1.20"},{"v":120,"d":"120.00"},{"v":1062,"d":"1,062"},8.85,1,null,{"$f":"IFERROR(VLOOKUP(C48,#REF!,6,FALSE),\"\")","v":""},{"$f":"IFERROR(VLOOKUP(C48,#REF!,6,FALSE),\"\")","v":""},null,{"$f":"IFERROR(VLOOKUP(C48,#REF!,6,FALSE),\"\")","v":""}]
[null,"***","SC000416047",26,"Laminato a freddo","P05",{"v":1.2,"d":"1.20"},{"v":120,"d":"120.00"},{"v":1062,"d":"1,062"},8.85,1,null,{"$f":"IFERROR(VLOOKUP(C49,#REF!,6,FALSE),\"\")","v":""},{"$f":"IFERROR(VLOOKUP(C49,#REF!,6,FALSE),\"\")","v":""},null,{"$f":"IFERROR(VLOOKUP(C49,#REF!,6,FALSE),\"\")","v":""}]
[null,"025G200396","SC000416048",27,"Laminato a freddo","DC01",{"v":1,"d":"1.00"},{"v":91,"d":"91.00"},{"v":1492,"d":"1,492"},{"v":8.197802197802197,"d":"8.20"},2,null,{"$f":"IFERROR(VLOOKUP(C50,#REF!,6,FALSE),\"\")","v":""},{"$f":"IFERROR(VLOOKUP(C50,#REF!,6,FALSE),\"\")","v":""},null,{"$f":"IFERROR(VLOOKUP(C50,#REF!,6,FALSE),\"\")","v":""}]
[null,"25H6002919","SC000416049",28,"Decapato","DD13",{"v":3,"d":"3.00"},{"v":120,"d":"120.00"},872,{"v":7.266666666666667,"d":"7.27"},1,null,{"$f":"IFERROR(VLOOKUP(C51,#REF!,6,FALSE),\"\")","v":""},{"$f":"IFERROR(VLOOKUP(C51,#REF!,6,FALSE),\"\")","v":""},null,{"$f":"IFERROR(VLOOKUP(C51,#REF!,6,FALSE),\"\")","v":""}]
[null,"24HB033208","SC000416050",29,"Laminato a freddo","DC01",{"v":1,"d":"1.00"},{"v":90,"d":"90.00"},{"v":1065,"d":"1,065"},{"v":11.833333333333334,"d":"11.83"},1,null,{"$f":"IFERROR(VLOOKUP(C52,#REF!,6,FALSE),\"\")","v":""},{"$f":"IFERROR(VLOOKUP(C52,#REF!,6,FALSE),\"\")","v":""},null,{"$f":"IFERROR(VLOOKUP(C52,#REF!,6,FALSE),\"\")","v":""}]
[null,"24HB033220","SC000416051",29,"Laminato a freddo","DC01",{"v":1,"d":"1.00"},{"v":90,"d":"90.00"},{"v":1065,"d":"1,065"},{"v":11.833333333333334,"d":"11.83"},1,null,{"$f":"IFERROR(VLOOKUP(C53,#REF!,6,FALSE),\"\")","v":""},{"$f":"IFERROR(VLOOKUP(C53,#REF!,6,FALSE),\"\")","v":""},null,{"$f":"IFERROR(VLOOKUP(C53,#REF!,6,FALSE),\"\")","v":""}]
[null,"024G211062","SC000416052",30,"Laminato a freddo","HC340LA",0.81,{"v":91,"d":"91.00"},{"v":1432,"d":"1,432"},{"v":7.868131868131868,"d":"7.87"},2,null,{"$f":"IFERROR(VLOOKUP(C54,#REF!,6,FALSE),\"\")","v":""},{"$f":"IFERROR(VLOOKUP(C54,#REF!,6,FALSE),\"\")","v":""},null,{"$f":"IFERROR(VLOOKUP(C54,#REF!,6,FALSE),\"\")","v":""}]
[null,"24HB033222","SC000416053",31,"Laminato a freddo","DC01",{"v":1,"d":"1.00"},{"v":90,"d":"90.00"},{"v":1065,"d":"1,065"},{"v":11.833333333333334,"d":"11.83"},1,null,{"$f":"IFERROR(VLOOKUP(C55,#REF!,6,FALSE),\"\")","v":""},{"$f":"IFERROR(VLOOKUP(C55,#REF!,6,FALSE),\"\")","v":""},null,{"$f":"IFERROR(VLOOKUP(C55,#REF!,6,FALSE),\"\")","v":""}]
[null,"24HB033221","SC000416054",31,"Laminato a freddo","DC01",{"v":1,"d":"1.00"},{"v":90,"d":"90.00"},{"v":1065,"d":"1,065"},{"v":11.833333333333334,"d":"11.83"},1,null,{"$f":"IFERROR(VLOOKUP(C56,#REF!,6,FALSE),\"\")","v":""},{"$f":"IFERROR(VLOOKUP(C56,#REF!,6,FALSE),\"\")","v":""},null,{"$f":"IFERROR(VLOOKUP(C56,#REF!,6,FALSE),\"\")","v":""}]
[null,"25H8003226","SC000416055",32,"Laminato a freddo","DC01",1.01,{"v":65,"d":"65.00"},{"v":1117,"d":"1,117"},{"v":17.184615384615384,"d":"17.18"},1,null,{"$f":"IFERROR(VLOOKUP(C57,#REF!,6,FALSE),\"\")","v":""},{"$f":"IFERROR(VLOOKUP(C57,#REF!,6,FALSE),\"\")","v":""},null,{"$f":"IFERROR(VLOOKUP(C57,#REF!,6,FALSE),\"\")","v":""}]
[null,"25H8003231","SC000416056",32,"Laminato a freddo","DC01",1.01,{"v":65,"d":"65.00"},{"v":1021,"d":"1,021"},{"v":15.707692307692307,"d":"15.71"},1,null,{"$f":"IFERROR(VLOOKUP(C58,#REF!,6,FALSE),\"\")","v":""},{"$f":"IFERROR(VLOOKUP(C58,#REF!,6,FALSE),\"\")","v":""},null,{"$f":"IFERROR(VLOOKUP(C58,#REF!,6,FALSE),\"\")","v":""}]
[null,"025G201950","SC000416057",33,"Laminato a freddo","DC01",0.91,{"v":81,"d":"81.00"},{"v":2264,"d":"2,264"},{"v":4.658436213991769,"d":"4.66"},6,null,{"$f":"IFERROR(VLOOKUP(C59,#REF!,6,FALSE),\"\")","v":""},{"$f":"IFERROR(VLOOKUP(C59,#REF!,6,FALSE),\"\")","v":""},null,{"$f":"IFERROR(VLOOKUP(C59,#REF!,6,FALSE),\"\")","v":""}]
[null,"025G201964","SC000416058",34,"Laminato a freddo","DC03",1.51,{"v":79,"d":"79.00"},{"v":1364,"d":"1,364"},{"v":8.632911392405063,"d":"8.63"},2,null,{"$f":"IFERROR(VLOOKUP(C60,#REF!,6,FALSE),\"\")","v":""},{"$f":"IFERROR(VLOOKUP(C60,#REF!,6,FALSE),\"\")","v":""},null,{"$f":"IFERROR(VLOOKUP(C60,#REF!,6,FALSE),\"\")","v":""}]
{"$rows_left_out":228}